求助!项目引入easeui后报错,弄了两天了也没解决!
:app:transformClassesWithDexForZqt_palmICTDebug FAILED
FAILURE: Build failed with an exception.
* What went wrong:
Execution failed for task ':app:transformClassesWithDexForZqt_palmICTDebug'.
> com.android.build.api.transform.TransformException: com.android.ide.common.process.ProcessException: java.util.concurrent.ExecutionException: java.lang.UnsupportedOperationException
* Try:
Run with --stacktrace option to get the stack trace. Run with --info or --debug option to get more log output.
BUILD FAILED
Total time: 1 mins 0.16 secs
FAILURE: Build failed with an exception.
* What went wrong:
Execution failed for task ':app:transformClassesWithDexForZqt_palmICTDebug'.
> com.android.build.api.transform.TransformException: com.android.ide.common.process.ProcessException: java.util.concurrent.ExecutionException: java.lang.UnsupportedOperationException
* Try:
Run with --stacktrace option to get the stack trace. Run with --info or --debug option to get more log output.
BUILD FAILED
Total time: 1 mins 0.16 secs
没有找到相关结果
已邀请:
1 个回复
[已注销]